Compilation Error Sizeofshort =2

7 Oct

Compilation Error Sizeofshort =2

RECOMMENDED: If you have Windows errors then we strongly recommend that you download and run this (Windows) Repair Tool.

Eval Error Handling Php Truncation Error In Mesh Free Particle Methods Particle methods in CFD – Idea of particle methods: concentrate mass on points (particles). Integrals. Systematic investigation of truncation error (in particular remeshing). In DNS of. In section 2, the use of SPH in free-surface flows is discussed, giving examples of its. central idea of this method is

C – declare a, b an object of type ‘int’ int a = 1, b; a + 1 = b; // Error, left expression is // is not variable(a + 1) // declare pointer variable ‘p’, and ‘q’ int *p, *q; // *p, *q are lvalue *p = 1; // valid l-value assignment // below is invalid – "p + 2.

Truncation Error In Mesh Free Particle Methods Particle methods in CFD – Idea of particle methods: concentrate mass on points (particles). Integrals. Systematic investigation of truncation error (in particular remeshing). In DNS of. In section 2, the use of SPH in free-surface flows is discussed, giving examples of its. central idea of this method is to follow moving fluid particles, free of

[netCDF #MLF-697840]: Parallel NetCDF 4.1.3 compile error finding. – Jul 30, 2013. conftest: error while loading shared libraries: libsz.so.2: cannot open It compiled OK, but. checking whether we are cross compiling. configure: error: in. whether byte ordering is bigendian. no > >> checking size of short.

Compilation error refers to a state when a compiler fails to compile a piece of computer program source code, either due to errors in the code, or, more unusually,

When i try to configure glibc2.3.2 in pass 2 same error is comming.after this ". i have been compiling it in on my FC2 with 2.6.7 kernel

Event message: A compilation error has occurred. – Event message: A compilation error has occurred. SharePoint > SharePoint 2010 – Setup, Upgrade, Administration and Operations. SharePoint 2010 – Setup.

when opening a new webpage on Explorer the following message appears: "Microsoft JScript compilation error EXCEPINFO Description: Syntax Error – Source: Microsoft.

even though they may only result in compilation errors on one platform. To try.

Compile error under mingw inside cygwin #285. Check size of short – done. make[1]: *** [CMakeFiles/Makefile2:1165: CMakeFiles/sndfile.dir/all] Error 2

Although this may sound inconvenient, this is a great advantage since a lot of errors will be found at compile time itself. and libraries more readable and more easier to understand. b) Compilation Speed: Go code compiles really fast, so.

RECOMMENDED: Click here to fix Windows errors and improve system performance