Failure Baf.error.3 Task Failed

11 Oct

Failure Baf.error.3 Task Failed

RECOMMENDED: If you have Windows errors then we strongly recommend that you download and run this (Windows) Repair Tool.

Task Sequence Failed with the Error Code 0x80070002 – Operation aborted (Error: 80004004; Source: Windows) TSManager 3/3/2017 12:22:42 PM 1772 (0x06EC) Failed to run the last action: Partition Disk 0 – UEFI. Execution of task sequence failed. Element not found.

Jul 5, 2016. Figure 3: Number of beetles surviving to adulthood relative to the number of. and found that N. orbicollis larvae failed to survive to the second instar, Burying beetles are known to lay excess eggs as insurance against hatching failure. As parents took over the task of digesting the carcass, relaxed.

A recent study shows that emotional responses to failure may be more. After.

Pittsburgh Steelers – It was a failure of both players and coaching that led to the Steelers. They couldn’t do it—much as they have failed to do so in the past—and it cost them.

I am using SQL Server 2008 import and export wizard. I need to import a database. I opened the SQL server import/export wizard and I went through the following.

Error Communicating With The Specified Configmgr Site Server. a ConfigMgr 2007 Secondary Site server from. ConfigMgr Service Manager. Error communicating with the specified ConfigMgr Site Server. This error can. May 16, 2013. Recently I had some issues with a ConfigMgr 2012 SP1 Primary Site communicating with a. Unable to load user-specified certificate [Cert Hash(sha1 ). Check the SQL Server error log and

“A failure,” one man replied. And he vowed to create a security task force.

Re: "1 Failure BAF.Error.3 Task Failed". in reply to aussierodney Apr 26, 2014 3:00:30 PM. BAF.Error.3. The 18 make me the modification I want. Thank to all, I give closed this message.

For the latest documentation on Visual Studio 2017, see Visual Studio 2017 Documentation. For the latest documentation on Visual Studio 2017, see Error Task on.

BAF basal area factor. BA. Bureau of Appraisal, Florida Department of. D. All contract requirements should be included in the contractor's task or. G. Should either merchantable or pre-merchantable plots FAIL the paired “t” test, the TAC will. 2. Re-tally of all or selected cruise plots in stratum contributing to error. 3.

Error_code_gradle_build_failed_23. AL lib: (EE) alc_cleanup: 1 device not closed :runClient FAILED FAILURE: Build failed with an exception. * What went wrong: Execution failed for task ':runClient'. >

Event ID 203 — Task Monitoring and Control – Aug 05, 2011  · Event ID 203 — Task Monitoring and Control. or failed. The progress of a task can be. FAILURE: Message: Task Scheduler failed to launch.

Nov 29, 2016. best current methods fail to produce the correct copy num-. allele frequency ( BAF) to estimate the ploidy and purity of impure tumor genomes and. (3). Statistical model of haplotype depth under null hypothesis of absence of. The merging of every K SNPs gives a merging error, if the. With the tasks.

1 Failure Baf.error.3 Task Failed may be caused by windows system files damage. The corrupted system files entries can be a real threat to the well being of your computer.

Gushing about failure extenuates this terrible "everybody-gets-a-prize" mentality that threatens to reduce resilience in young people. Screwed up on a big task?.

Dec 9, 2008. Perhaps the most striking feature of the disease is the degree to which other. SD patients perform well on phonological discrimination tasks such as minimal. Error rates at the whole item level were also analysed, with the prediction. Figure 3 shows serial position curves for the pure and mixed lists.

This Account has been suspended.

After this first test, the students were asked either to focus on their emotional responses to their failure or to the cognitive responses, including logical, rational assessments of why they failed. They then underwent another similar task. Don’t.

Are you having issues with the installer failing and/or shooting out various errors causing the app from installing? (Sometimes stray processes can hide in your system tray or your task manager- double check those!) Delete the 2 following folders

RECOMMENDED: Click here to fix Windows errors and improve system performance